Build 3.0.1/3.0.2 Enterprise From Source


#1

I am interested in building Enterprise from source on 3.0.1/3.0.2

after issuing the following commands:

repo init -u git://github.com/couchbase/manifest.git -m rel-3.0.2.xml
repo sync

I was able to build the server.

Calling cmake-gui . allowed me to switch Enterprise mode on.

Is this enough or is there something missing in rel-3.0.2.xml? rel-3.0.1.xml

Thanks

marco


#2

What exactly is your question here?

You said you were “able to build the server” so it sounds like you’ve answered your own question, assuming you have set the cmake BUILD_ENTERPRISE variable.


#3

Building something is one thing.

Being confident that you got it right is quite another thing.


#4

Building 3.0.2 from source.

Where is the best place to submit your “Make test” results and where do I find the results file
on the test system.

The following tests FAILED:
11 - memcached-config (OTHER_FAULT)
23 - couchstore-purge (Failed)
59 - couchdb-couch_set_view-00-prepare (Failed)
60 - couchdb-couch_set_view-01-collation (Failed)
61 - couchdb-couch_set_view-01-headers (Failed)
62 - couchdb-couch_set_view-01-load (Failed)
63 - couchdb-couch_set_view-02-old-index-cleanup (Failed)
64 - couchdb-couch_set_view-03-db-compaction-file-leaks (Failed)
65 - couchdb-couch_set_view-05-replicas-transfer (Failed)
66 - couchdb-couch_set_view-06-main-compaction (Failed)
67 - couchdb-couch_set_view-07-replica-compaction (Failed)
68 - couchdb-couch_set_view-08-deletes-cleanup (Failed)
69 - couchdb-couch_set_view-09-deletes-cleanup-many-views (Failed)
70 - couchdb-couch_set_view-10-updates-cleanup (Failed)
71 - couchdb-couch_set_view-11-updates-cleanup-many-views (Failed)
72 - couchdb-couch_set_view-12-errors (Failed)
73 - couchdb-couch_set_view-13-progressive-cleanup (Failed)
74 - couchdb-couch_set_view-14-duplicated-keys-per-doc (Failed)
75 - couchdb-couch_set_view-15-passive-partitions (Failed)
76 - couchdb-couch_set_view-16-pending-transition (Failed)
77 - couchdb-couch_set_view-17-unindexable-partitions (Failed)
78 - couchdb-couch_set_view-18-monitor-partition-updates (Failed)
79 - couchdb-couch_set_view-19-compaction-retry (Failed)
80 - couchdb-couch_set_view-20-debug-params (Failed)
81 - couchdb-couch_set_view-21-updater-cleanup (Failed)
82 - couchdb-couch_set_view-22-compactor-cleanup (Failed)
83 - couchdb-couch_set_view-23-replica-group-missing (Failed)
84 - couchdb-couch_set_view-24-updater-add-more-passive-partitions (Failed)
85 - couchdb-couch_set_view-25-util-stats (Failed)
86 - couchdb-couch_set_view-26-multiple-reductions (Failed)
87 - couchdb-couch_set_view-27-dev-views (Failed)
88 - couchdb-couch_set_view-28-big-reduce (Failed)
89 - couchdb-couch_set_view-29-rollback (Failed)
90 - couchdb-couch_set_view-30-query-fdleaks (Failed)
91 - couchdb-couch_set_view-31-ryow-query (Failed)
92 - couchdb-couch_set_view-32-upgrade (Failed)
93 - couchdb-couch_view_parser-01-map-view (Failed)
94 - couchdb-couch_view_parser-02-reduce-view (Failed)
95 - couchdb-couch_dcp-00-prepare (Failed)
96 - couchdb-couch_dcp-01-load (Failed)
97 - couchdb-couch_dcp-04-view-groups (Failed)
98 - couchdb-couch_dcp-05-couch-dcp-client (Failed)
99 - couchdb-mapreduce-01-map (Failed)
100 - couchdb-mapreduce-02-reduce (Failed)
101 - couchdb-mapreduce-03-builtin-functions (Failed)
102 - couchdb-etap-001-load (Failed)
103 - couchdb-etap-002-icu-driver (Failed)
104 - couchdb-etap-010-file-basics (Failed)
105 - couchdb-etap-011-file-headers (Failed)
106 - couchdb-etap-020-btree-basics (Failed)
107 - couchdb-etap-021-btree-reductions (Failed)
108 - couchdb-etap-022-btree-copy (Failed)
109 - couchdb-etap-023-btree-guided-purge (Failed)
110 - couchdb-etap-024-btree-guided-fold (Failed)
111 - couchdb-etap-030-doc-from-json (Failed)
112 - couchdb-etap-031-doc-to-json (Failed)
113 - couchdb-etap-032-doc-to-binary-views (Failed)
114 - couchdb-etap-033-doc-from-binary (Failed)
115 - couchdb-etap-040-util (Failed)
116 - couchdb-etap-041-uuid-gen (Failed)
117 - couchdb-etap-042-work-queue (Failed)
118 - couchdb-etap-070-couch-db (Failed)
119 - couchdb-etap-071-couch-db-external-write (Failed)
120 - couchdb-etap-073-changes (Failed)
121 - couchdb-etap-080-config-get-set (Failed)
122 - couchdb-etap-081-config-override (Failed)
123 - couchdb-etap-082-config-register (Failed)
124 - couchdb-etap-083-config-no-files (Failed)
125 - couchdb-etap-090-task-status (Failed)
126 - couchdb-etap-100-ref-counter (Failed)
127 - couchdb-etap-150-invalid-view-seq (Failed)
128 - couchdb-etap-190-json-stream-parse (Failed)
129 - couchdb-etap-201-view-group-shutdown (Failed)
130 - couchdb-etap-202-dev-view-group-shutdown (Failed)
Errors while running CTest
make[2]: *** [test] Error 8
make[1]: *** [test] Error 2
make: *** [test] Error 2