Node SDK fails on Mac 10.11 (El Capitan)


#1

Tried to npm install 2.0.12:
(also note node 4.1.1 and npm 2.14.4)

build errors (node_modules/couchbase/lib/../builderror.log):
---
In file included from ../src/couchbase_impl.cc:21:
In file included from ../src/couchbase_impl.h:40:
../node_modules/nan/nan.h:261:25: error: redefinition of '_NanEnsureLocal'
NAN_INLINE v8::Local<T> _NanEnsureLocal(v8::Local<T> val) {
                        ^
../node_modules/nan/nan.h:256:25: note: previous definition is here
NAN_INLINE v8::Local<T> _NanEnsureLocal(v8::Handle<T> val) {
                        ^
../node_modules/nan/nan.h:661:13: error: no member named 'smalloc' in namespace 'node'
    , node::smalloc::FreeCallback callback
      ~~~~~~^
../node_modules/nan/nan.h:672:12: error: no matching function for call to 'New'
    return node::Buffer::New(v8::Isolate::GetCurrent(), data, size);
           ^~~~~~~~~~~~~~~~~
/Users/andrewrosenberg/.node-gyp/4.1.1/include/node/node_buffer.h:31:40: note: candidate function not viable: no known conversion from 'uint32_t' (aka 'unsigned int') to 'enum encoding' for 3rd argument
NODE_EXTERN v8::MaybeLocal<v8::Object> New(v8::Isolate* isolate,
                                       ^
/Users/andrewrosenberg/.node-gyp/4.1.1/include/node/node_buffer.h:43:40: note: candidate function not viable: 2nd argument ('const char *') would lose const qualifier
NODE_EXTERN v8::MaybeLocal<v8::Object> New(v8::Isolate* isolate,
                                       ^
/Users/andrewrosenberg/.node-gyp/4.1.1/include/node/node_buffer.h:28:40: note: candidate function not viable: requires 2 arguments, but 3 were provided
NODE_EXTERN v8::MaybeLocal<v8::Object> New(v8::Isolate* isolate, size_t length);
                                       ^
/Users/andrewrosenberg/.node-gyp/4.1.1/include/node/node_buffer.h:36:40: note: candidate function not viable: requires 5 arguments, but 3 were provided
NODE_EXTERN v8::MaybeLocal<v8::Object> New(v8::Isolate* isolate,
                                       ^
In file included from ../src/couchbase_impl.cc:21:
In file included from ../src/couchbase_impl.h:40:
../node_modules/nan/nan.h:676:12: error: no viable conversion from 'v8::MaybeLocal<v8::Object>' to 'v8::Local<v8::Object>'
    return node::Buffer::New(v8::Isolate::GetCurrent(), size);
           ^~~~~~~~~~~~~~~~~~~~~~~~~~~~~~~~~~~~~~~~~~~~~~~~~~
/Users/andrewrosenberg/.node-gyp/4.1.1/include/node/v8.h:210:7: note: candidate constructor (the implicit copy constructor) not viable: no known conversion from 'v8::MaybeLocal<v8::Object>' to 'const v8::Local<v8::Object> &' for 1st argument
class Local {
      ^
/Users/andrewrosenberg/.node-gyp/4.1.1/include/node/v8.h:210:7: note: candidate constructor (the implicit move constructor) not viable: no known conversion from 'v8::MaybeLocal<v8::Object>' to 'v8::Local<v8::Object> &&' for 1st argument
class Local {
      ^
/Users/andrewrosenberg/.node-gyp/4.1.1/include/node/v8.h:214:13: note: candidate template ignored: could not match 'Local' against 'MaybeLocal'
  V8_INLINE Local(Local<S> that)
            ^
/Users/andrewrosenberg/.node-gyp/4.1.1/include/node/v8.h:326:13: note: candidate template ignored: could not match 'S *' against 'v8::MaybeLocal<v8::Object>'
  V8_INLINE Local(S* that)
            ^
In file included from ../src/couchbase_impl.cc:21:
In file included from ../src/couchbase_impl.h:40:
../node_modules/nan/nan.h:683:26: error: no member named 'Use' in namespace 'node::Buffer'
    return node::Buffer::Use(v8::Isolate::GetCurrent(), data, size);
           ~~~~~~~~~~~~~~^
In file included from ../src/couchbase_impl.cc:21:
In file included from ../src/couchbase_impl.h:39:
In file included from /Users/andrewrosenberg/.node-gyp/4.1.1/include/node/node.h:42:
/Users/andrewrosenberg/.node-gyp/4.1.1/include/node/v8.h:221:5: error: assigning to 'v8::Primitive *volatile' from incompatible type 'v8::Value *'
    TYPE_CHECK(T, S);
    ^~~~~~~~~~~~~~~~
/Users/andrewrosenberg/.node-gyp/4.1.1/include/node/v8.h:180:37: note: expanded from macro 'TYPE_CHECK'
    *(static_cast<T* volatile*>(0)) = static_cast<S*>(0);      \
                                    ^ ~~~~~~~~~~~~~~~~~~
../node_modules/nan/nan.h:414:12: note: in instantiation of function template specialization 'v8::Local<v8::Primitive>::Local<v8::Value>' requested here
    return NanEscapeScope(NanNew(v8::Undefined(v8::Isolate::GetCurrent())));
           ^
../node_modules/nan/nan.h:398:30: note: expanded from macro 'NanEscapeScope'
# define NanEscapeScope(val) scope.Escape(_NanEnsureLocal(val))
                             ^
In file included from ../src/couchbase_impl.cc:21:
In file included from ../src/couchbase_impl.h:39:
In file included from /Users/andrewrosenberg/.node-gyp/4.1.1/include/node/node.h:42:
/Users/andrewrosenberg/.node-gyp/4.1.1/include/node/v8.h:221:5: error: assigning to 'v8::Boolean *volatile' from incompatible type 'v8::Value *'
    TYPE_CHECK(T, S);
    ^~~~~~~~~~~~~~~~
/Users/andrewrosenberg/.node-gyp/4.1.1/include/node/v8.h:180:37: note: expanded from macro 'TYPE_CHECK'
    *(static_cast<T* volatile*>(0)) = static_cast<S*>(0);      \
                                    ^ ~~~~~~~~~~~~~~~~~~
../node_modules/nan/nan.h:424:12: note: in instantiation of function template specialization 'v8::Local<v8::Boolean>::Local<v8::Value>' requested here
    return NanEscapeScope(NanNew(v8::True(v8::Isolate::GetCurrent())));
           ^
../node_modules/nan/nan.h:398:30: note: expanded from macro 'NanEscapeScope'
# define NanEscapeScope(val) scope.Escape(_NanEnsureLocal(val))
                             ^
In file included from ../src/couchbase_impl.cc:21:
In file included from ../src/couchbase_impl.h:39:
In file included from /Users/andrewrosenberg/.node-gyp/4.1.1/include/node/node.h:42:
/Users/andrewrosenberg/.node-gyp/4.1.1/include/node/v8.h:221:5: error: assigning to 'v8::Function *volatile' from incompatible type 'v8::Value *'
    TYPE_CHECK(T, S);
    ^~~~~~~~~~~~~~~~
/Users/andrewrosenberg/.node-gyp/4.1.1/include/node/v8.h:180:37: note: expanded from macro 'TYPE_CHECK'
    *(static_cast<T* volatile*>(0)) = static_cast<S*>(0);      \
                                    ^ ~~~~~~~~~~~~~~~~~~
../node_modules/nan/nan.h:1514:12: note: in instantiation of function template specialization 'v8::Local<v8::Function>::Local<v8::Value>' requested here
    return NanEscapeScope(NanNew(handle)->Get(kCallbackIndex)
           ^
../node_modules/nan/nan.h:398:30: note: expanded from macro 'NanEscapeScope'
# define NanEscapeScope(val) scope.Escape(_NanEnsureLocal(val))
                             ^
In file included from ../src/couchbase_impl.cc:21:
In file included from ../src/couchbase_impl.h:39:
In file included from /Users/andrewrosenberg/.node-gyp/4.1.1/include/node/node.h:42:
/Users/andrewrosenberg/.node-gyp/4.1.1/include/node/v8.h:221:5: error: assigning to 'v8::Object *volatile' from incompatible type 'v8::Value *'
    TYPE_CHECK(T, S);
    ^~~~~~~~~~~~~~~~
/Users/andrewrosenberg/.node-gyp/4.1.1/include/node/v8.h:180:37: note: expanded from macro 'TYPE_CHECK'
    *(static_cast<T* volatile*>(0)) = static_cast<S*>(0);      \
                                    ^ ~~~~~~~~~~~~~~~~~~
../node_modules/nan/nan.h:1632:12: note: in instantiation of function template specialization 'v8::Local<v8::Object>::Local<v8::Value>' requested here
    return NanEscapeScope(handle->Get(NanNew(key)).As<v8::Object>());
           ^
../node_modules/nan/nan.h:398:30: note: expanded from macro 'NanEscapeScope'
# define NanEscapeScope(val) scope.Escape(_NanEnsureLocal(val))
                             ^
9 errors generated.
make: *** [Release/obj.target/couchbase_impl/src/couchbase_impl.o] Error 1
gyp ERR! build error 
gyp ERR! stack Error: `make` failed with exit code: 2
gyp ERR! stack     at ChildProcess.onExit (/usr/local/lib/node_modules/npm/node_modules/node-gyp/lib/build.js:270:23)
gyp ERR! stack     at emitTwo (events.js:87:13)
gyp ERR! stack     at ChildProcess.emit (events.js:172:7)
gyp ERR! stack     at Process.ChildProcess._handle.onexit (internal/child_process.js:200:12)
gyp ERR! System Darwin 15.0.0
gyp ERR! command "/usr/local/bin/node" "/usr/local/lib/node_modules/npm/node_modules/node-gyp/bin/node-gyp.js" "rebuild"
gyp ERR! cwd /ddi/workspace/ddi-loyalty-app/node_modules/couchbase
gyp ERR! node -v v4.1.1
gyp ERR! node-gyp -v v3.0.3
gyp ERR! not ok 

---
load exceptions:
---
`couchbase_impl`:
{ [Error: Could not locate the bindings file. Tried:
 → /ddi/workspace/ddi-loyalty-app/node_modules/couchbase/build/couchbase_impl.node
 → /ddi/workspace/ddi-loyalty-app/node_modules/couchbase/build/Debug/couchbase_impl.node
 → /ddi/workspace/ddi-loyalty-app/node_modules/couchbase/build/Release/couchbase_impl.node
 → /ddi/workspace/ddi-loyalty-app/node_modules/couchbase/out/Debug/couchbase_impl.node
 → /ddi/workspace/ddi-loyalty-app/node_modules/couchbase/Debug/couchbase_impl.node
 → /ddi/workspace/ddi-loyalty-app/node_modules/couchbase/out/Release/couchbase_impl.node
 → /ddi/workspace/ddi-loyalty-app/node_modules/couchbase/Release/couchbase_impl.node
 → /ddi/workspace/ddi-loyalty-app/node_modules/couchbase/build/default/couchbase_impl.node
 → /ddi/workspace/ddi-loyalty-app/node_modules/couchbase/compiled/4.1.1/darwin/x64/couchbase_impl.node]
  tries: 
   [ '/ddi/workspace/ddi-loyalty-app/node_modules/couchbase/build/couchbase_impl.node',
     '/ddi/workspace/ddi-loyalty-app/node_modules/couchbase/build/Debug/couchbase_impl.node',
     '/ddi/workspace/ddi-loyalty-app/node_modules/couchbase/build/Release/couchbase_impl.node',
     '/ddi/workspace/ddi-loyalty-app/node_modules/couchbase/out/Debug/couchbase_impl.node',
     '/ddi/workspace/ddi-loyalty-app/node_modules/couchbase/Debug/couchbase_impl.node',
     '/ddi/workspace/ddi-loyalty-app/node_modules/couchbase/out/Release/couchbase_impl.node',
     '/ddi/workspace/ddi-loyalty-app/node_modules/couchbase/Release/couchbase_impl.node',
     '/ddi/workspace/ddi-loyalty-app/node_modules/couchbase/build/default/couchbase_impl.node',
     '/ddi/workspace/ddi-loyalty-app/node_modules/couchbase/compiled/4.1.1/darwin/x64/couchbase_impl.node' ] }
---
/ddi/workspace/ddi-loyalty-app/node_modules/couchbase/lib/binding.js:188
  throw new Error('Failed to locate couchnode native binding' +
  ^

Error: Failed to locate couchnode native binding (see above for more information!)
    at Object.<anonymous> (/ddi/workspace/ddi-loyalty-app/node_modules/couchbase/lib/binding.js:188:9)
    at Module._compile (module.js:434:26)
    at Object.Module._extensions..js (module.js:452:10)
    at Module.load (module.js:355:32)
    at Function.Module._load (module.js:310:12)
    at Module.require (module.js:365:17)
    at require (module.js:384:17)
    at Object.<anonymous> (/ddi/workspace/ddi-loyalty-app/node_modules/couchbase/lib/couchbase.js:3:15)
    at Module._compile (module.js:434:26)
    at Object.Module._extensions..js (module.js:452:10)

Also tried 2.1.2 but it gives a client timeout on every operation

{ [CouchbaseError: Client-Side timeout exceeded for operation. Inspect network conditions or increase the timeout]
  message: 'Client-Side timeout exceeded for operation. Inspect network conditions or increase the timeout',
  code: 23 }

Looks like this might explain it: Eventual support for io.js/nodejs v4.0.0 (NAN >= 2.X)
However it doesn’t explain why node.js SDK 2.1.2 doesn’t connect.